{"text_format":"1","workbook":"xlsx","n_sheets":4,"sheets":["横長","社員マスタ","伝票風","月額表"],"not_rendered":{"charts":0,"images":0,"macros":1,"external_links":0,"defined_names":49,"comments":0,"pivot_tables":0},"unopened":[],"bounds":{"document_bytes":16777216,"sheet_cells":100000,"rows_first":2000,"rows_last":500,"rows_between":2000,"halvings":0,"cell_chars":16384,"cell_head_chars":4096},"cells_cut":0,"cells_raw":0,"read":"whole","date_system":"1900"}

{"sheet":"横長","index":0,"n_rows":48,"n_cols":50,"rows_kept":48,"cut":false,"hidden":false,"merged":[[28,25,28,28],[28,29,28,32],[28,33,28,36],[28,37,28,40],[28,41,28,44],[28,45,28,48],[28,49,28,52],[0,10,0,12],[4,9,4,12],[21,41,21,44],[19,9,19,12],[20,9,20,12],[15,49,15,52],[16,49,16,52],[0,28,0,29],[0,31,0,32],[2,45,2,48],[13,39,13,41],[13,47,13,52],[26,10,26,12],[26,14,26,15],[26,24,26,26],[26,28,26,29],[26,31,26,32],[22,41,22,44],[22,45,22,48],[22,49,22,52],[7,0,7,4],[7,5,7,8],[7,9,7,12],[8,9,8,12],[24,0,24,8],[24,9,24,12],[17,17,17,20],[18,37,18,40],[17,49,17,52],[18,5,18,8],[18,9,18,12],[18,13,18,16],[18,17,18,20],[18,21,18,24],[18,41,18,44],[17,41,17,44],[17,45,17,48],[18,49,18,52],[19,5,19,8],[20,5,20,8],[17,21,17,24],[2,37,2,40],[20,0,20,4],[21,1,23,3],[22,13,22,16],[22,17,22,20],[22,21,22,24],[22,25,22,28],[22,29,22,32],[22,33,22,36],[22,37,22,40],[23,5,23,8],[2,13,2,16],[3,13,3,16],[3,9,3,12],[2,1,3,3],[4,1,6,3],[8,1,10,3],[2,5,2,8],[3,5,3,8],[2,9,2,12],[17,1,19,3],[17,5,17,8],[17,9,17,12],[17,13,17,16],[0,14,0,15],[4,5,4,8],[6,5,6,8],[5,5,5,8],[8,49,8,52],[9,49,9,52],[8,41,8,44],[9,41,9,44],[8,33,8,36],[9,33,9,36],[4,49,4,52],[4,41,4,44],[8,17,8,20],[9,17,9,20],[8,25,8,28],[9,25,9,28],[5,17,5,20],[5,25,5,28],[4,37,4,40],[4,17,4,20],[4,25,4,28],[0,24,0,26],[0,39,0,41],[0,47,0,52],[37,0,37,8],[37,9,37,12],[8,45,8,48],[9,45,9,48],[11,0,11,8],[10,9,10,12],[11,9,11,12],[8,37,8,40],[9,37,9,40],[8,21,8,24],[9,21,9,24],[8,13,8,16],[9,13,9,16],[8,29,8,32],[9,29,9,32],[9,9,9,12],[10,5,10,8],[35,17,35,20],[35,21,35,24],[35,25,35,28],[35,29,35,32],[35,33,35,36],[35,37,35,40],[35,41,35,44],[35,45,35,48],[35,49,35,52],[34,17,34,20],[34,21,34,24],[34,25,34,28],[34,29,34,32],[34,33,34,36],[34,37,34,40],[34,41,34,44],[34,45,34,48],[34,49,34,52],[34,1,36,3],[34,5,34,8],[34,9,34,12],[34,13,34,16],[35,5,35,8],[35,9,35,12],[35,13,35,16],[36,5,36,8],[36,9,36,12],[31,41,31,44],[31,45,31,48],[31,49,31,52],[31,17,31,20],[31,21,31,24],[31,25,31,28],[31,29,31,32],[31,33,31,36],[31,37,31,40],[31,5,31,8],[31,9,31,12],[31,13,31,16],[32,5,32,8],[32,9,32,12],[33,5,33,8],[33,9,33,12],[30,1,32,3],[33,0,33,4],[30,41,30,44],[30,45,30,48],[30,49,30,52],[29,5,29,8],[29,9,29,12],[29,13,29,16],[29,17,29,20],[29,21,29,24],[29,25,29,28],[29,29,29,32],[29,33,29,36],[29,37,29,40],[29,41,29,44],[30,5,30,8],[30,9,30,12],[30,13,30,16],[30,17,30,20],[30,21,30,24],[30,25,30,28],[30,29,30,32],[30,33,30,36],[30,37,30,40],[28,1,29,3],[28,5,28,8],[28,9,28,12],[28,13,28,16],[21,49,21,52],[23,9,23,12],[22,5,22,8],[22,9,22,12],[21,17,21,20],[21,21,21,24],[21,5,21,8],[21,9,21,12],[21,13,21,16],[21,25,21,28],[21,29,21,32],[21,33,21,36],[21,37,21,40],[21,45,21,48],[29,45,29,48],[29,49,29,52],[28,17,28,20],[28,21,28,24],[26,39,26,41],[26,47,26,52],[17,25,17,28],[17,29,17,32],[15,41,15,44],[16,41,16,44],[15,45,15,48],[18,45,18,48],[17,33,17,36],[17,37,17,40],[16,45,16,48],[18,25,18,28],[18,29,18,32],[18,33,18,36],[16,9,16,12],[16,13,16,16],[16,17,16,20],[16,21,16,24],[16,25,16,28],[16,29,16,32],[15,21,15,24],[15,25,15,28],[15,29,15,32],[2,41,2,44],[3,41,3,44],[4,45,4,48],[3,37,3,40],[15,1,16,3],[15,5,15,8],[15,9,15,12],[15,13,15,16],[15,17,15,20],[5,41,5,44],[16,5,16,8],[15,33,15,36],[15,37,15,40],[16,33,16,36],[16,37,16,40],[13,10,13,12],[13,14,13,15],[13,24,13,26],[13,28,13,29],[13,31,13,32],[6,9,6,12],[5,9,5,12],[8,5,8,8],[9,5,9,8],[2,29,2,32],[3,29,3,32],[3,17,3,20],[2,25,2,28],[3,25,3,28],[2,21,2,24],[3,21,3,24],[5,49,5,52],[4,13,4,16],[4,21,4,24],[4,29,4,32],[5,13,5,16],[5,21,5,24],[5,29,5,32],[5,33,5,36],[5,37,5,40],[5,45,5,48],[2,17,2,20],[2,33,2,36],[3,33,3,36],[4,33,4,36],[2,49,2,52],[3,45,3,48],[3,49,3,52]]}
["給与支給明細書",null,null,null,null,null,null,null,null,null,null,null,null,"年",null,null,"月分",null,null,null,"支給年月日",null,null,null,null,null,null,"年",null,null,"月",null,null,"日",null,null,"コード",null,null,"A011",null,null,null,null,null,"氏名",null,{"$f":"LOOKUP(code1,社員マスタ,氏名)","v":"東京　花子"}]
[]
[null,"勤怠",null,null,null,"出勤日数",null,null,null,null,null,null,null,"欠勤日数",null,null,null,null,null,null,null,"有給休暇",null,null,null,null,null,null,null,"代休日数"]
[null,null,null,null,null,"残業時間",null,null,null,2,null,null,null,"早出残業",null,null,null,null,null,null,null,"早朝深夜"]
[null,"支給額",null,null,null,"基本給",null,null,null,{"$f":"LOOKUP(code1,社員マスタ,基本給)","v":200001},null,null,null,"残業手当",null,null,null,{"$f":"J5/(8*21)*1.25*J4","v":2976.2053571428573},null,null,null,"通勤手当",null,null,null,{"$f":"LOOKUP(code1,社員マスタ,通勤手当)","v":12010},null,null,null,"住宅手当",null,null,null,{"$f":"LOOKUP(code1,社員マスタ,通勤手当)","v":12010},null,null,null,"家族手当",null,null,null,{"$f":"LOOKUP(code1,社員マスタ,家族手当)","v":5010},null,null,null,"通勤費",null,null,null,{"$f":"LOOKUP(code1,社員マスタ,通勤手当)","v":12010}]
[]
[null,null,null,null,null,"計",null,null,null,{"$f":"IF(J5+R5+Z5+AH5+AP5+AX5+J6+R6+Z6+AH6+AP6+AX6>0,J5+R5+Z5+AH5+AP5+AX5+J6+R6+Z6+AH6+AP6+AX6,\"\")","v":244017.20535714287}]
["課税対象額",null,null,null,null,"計",null,null,null,{"$f":"J7-AX5-J9-R9-Z9-AH9","v":204257.11933035715}]
[null,"控除額",null,null,null,"健康保険",null,null,null,{"$f":"LOOKUP(code1,社員マスタ,健康保険)","v":7010},null,null,null,"介護保険",null,null,null,{"$f":"LOOKUP(code1,社員マスタ,介護保険)","v":2510},null,null,null,"厚生年金",null,null,null,{"$f":"LOOKUP(code1,社員マスタ,厚生年金)","v":17010},null,null,null,"雇用保険",null,null,null,{"$f":"J7*(5/1000)","v":1220.0860267857145}]
[null,null,null,null,null,"所得税",null,null,null,{"$f":"GenSenTax(課税対象額,LOOKUP(code1,社員マスタ,扶養人数))","v":4190},null,null,null,"住民税",null,null,null,{"$f":"LOOKUP(code1,社員マスタ,住民税)","v":4010}]
[null,null,null,null,null,"計",null,null,null,{"$f":"J9+R9+Z9+AH9+J10+R10","v":35950.086026785713}]
["差引支給額",null,null,null,null,null,null,null,null,{"$f":"N(J7)-AX5-J9-R9-Z9-AH9","v":204257.11933035715}]
[]
["給与支給明細書",null,null,null,null,null,null,null,null,null,null,null,null,"年",null,null,"月分",null,null,null,"支給年月日",null,null,null,null,null,null,"年",null,null,"月",null,null,"日",null,null,"コード",null,null,"A006",null,null,null,null,null,"氏名",null,{"$f":"LOOKUP(code2,社員マスタ,氏名)","v":"埼玉　４男"}]
[]
[null,"勤怠",null,null,null,"出勤日数",null,null,null,null,null,null,null,"欠勤日数",null,null,null,null,null,null,null,"有給休暇",null,null,null,null,null,null,null,"代休日数"]
[null,null,null,null,null,"残業時間",null,null,null,2,null,null,null,"早出残業",null,null,null,null,null,null,null,"早朝深夜"]
[null,"支給額",null,null,null,"基本給",null,null,null,{"$f":"LOOKUP(code2,社員マスタ,基本給)","v":960},null,null,null,"残業手当",null,null,null,{"$f":"J18/(8*21)*1.25*J17","v":14.285714285714286},null,null,null,"通勤手当",null,null,null,{"$f":"LOOKUP(code2,社員マスタ,通勤手当)","v":12005},null,null,null,"住宅手当",null,null,null,{"$f":"LOOKUP(code2,社員マスタ,住宅手当)","v":10005},null,null,null,"家族手当",null,null,null,{"$f":"LOOKUP(code2,社員マスタ,家族手当)","v":5005},null,null,null,"通勤費",null,null,null,{"$f":"LOOKUP(code2,社員マスタ,通勤手当)","v":12005}]
[]
[null,null,null,null,null,"計",null,null,null,{"$f":"IF(J18+R18+Z18+AH18+AP18+AX18+J19+R19+Z19+AH19+AP19+AX19>0,J18+R18+Z18+AH18+AP18+AX18+J19+R19+Z19+AH19+AP19+AX19,\"\")","v":39994.28571428571}]
["課税対象額",null,null,null,null,"計",null,null,null,{"$f":"J20-AX18-J22-R22-Z22-AH22","v":1274.3142857142816}]
[null,"控除額",null,null,null,"健康保険",null,null,null,{"$f":"LOOKUP(code2,社員マスタ,健康保険)","v":7005},null,null,null,"介護保険",null,null,null,{"$f":"LOOKUP(code2,社員マスタ,介護保険)","v":2505},null,null,null,"厚生年金",null,null,null,{"$f":"LOOKUP(code2,社員マスタ,厚生年金)","v":17005},null,null,null,"雇用保険",null,null,null,{"$f":"J20*(5/1000)","v":199.97142857142856}]
[null,null,null,null,null,"所得税",null,null,null,{"$f":"GenSenTax(課税対象額2,LOOKUP(code2,社員マスタ,扶養人数))","v":0},null,null,null,"住民税",null,null,null,{"$f":"LOOKUP(code1,社員マスタ,住民税)","v":4010}]
[null,null,null,null,null,"計",null,null,null,{"$f":"J22+R22+Z22+AH22+J23+R23","v":30724.971428571429}]
["差引支給額",null,null,null,null,null,null,null,null,{"$f":"IF(N(J20)-N(J24)=0,\"\",N(J20)-N(J24))","v":9269.3142857142811}]
[]
["給与支給明細書",null,null,null,null,null,null,null,null,null,null,null,null,"年",null,null,"月分",null,null,null,"支給年月日",null,null,null,null,null,null,"年",null,null,"月",null,null,"日",null,null,"コード",null,null,"A020",null,null,null,null,null,"氏名",null,{"$f":"LOOKUP(code3,社員マスタ,氏名)","v":"大坂　花子"}]
[]
[null,"勤怠",null,null,null,"出勤日数",null,null,null,null,null,null,null,"欠勤日数",null,null,null,null,null,null,null,"有給休暇",null,null,null,null,null,null,null,"代休日数"]
[null,null,null,null,null,"残業時間",null,null,null,2,null,null,null,"早出残業",null,null,null,null,null,null,null,"早朝深夜"]
[null,"支給額",null,null,null,"基本給",null,null,null,{"$f":"LOOKUP(code3,社員マスタ,基本給)","v":124300},null,null,null,"残業手当",null,null,null,{"$f":"J31/(8*21)*1.25*J30","v":1849.702380952381},null,null,null,"通勤手当",null,null,null,{"$f":"LOOKUP(code3,社員マスタ,通勤手当)","v":12019},null,null,null,"住宅手当",null,null,null,{"$f":"LOOKUP(code3,社員マスタ,住宅手当)","v":10019},null,null,null,"家族手当",null,null,null,{"$f":"LOOKUP(code3,社員マスタ,家族手当)","v":5019},null,null,null,"通勤費",null,null,null,{"$f":"LOOKUP(code3,社員マスタ,通勤手当)","v":12019}]
[]
[null,null,null,null,null,"計",null,null,null,{"$f":"IF(J31+R31+Z31+AH31+AP31+AX31+J32+R32+Z32+AH32+AP32+AX32>0,J31+R31+Z31+AH31+AP31+AX31+J32+R32+Z32+AH32+AP32+AX32,\"\")","v":165225.70238095237}]
["課税対象額",null,null,null,null,"計",null,null,null,{"$f":"J33-AX31-J35-R35-Z35-AH35","v":125823.5738690476}]
[null,"控除額",null,null,null,"健康保険",null,null,null,{"$f":"LOOKUP(code3,社員マスタ,健康保険)","v":7019},null,null,null,"介護保険",null,null,null,{"$f":"LOOKUP(code3,社員マスタ,介護保険)","v":2519},null,null,null,"厚生年金",null,null,null,{"$f":"LOOKUP(code3,社員マスタ,厚生年金)","v":17019},null,null,null,"雇用保険",null,null,null,{"$f":"J33*(5/1000)","v":826.12851190476181}]
[null,null,null,null,null,"所得税",null,null,null,{"$f":"GenSenTax(課税対象額3,LOOKUP(code3,社員マスタ,扶養人数))","v":1800},null,null,null,"住民税",null,null,null,{"$f":"LOOKUP(code3,社員マスタ,住民税)","v":4019}]
[null,null,null,null,null,"計",null,null,null,{"$f":"J35+R35+Z35+AH35+J36+R36","v":33202.128511904761}]
["差引支給額",null,null,null,null,null,null,null,null,{"$f":"IF(N(J33)-N(J37)=0,\"\",N(J33)-N(J37))","v":132023.5738690476}]
[]
[]
[null,"項目説明"]
[null,null,null,"：社員マスタの値をコードから索引して該当値が表示されます"]
[null,null,null,"：は手入力を行う"]
[null,null,null,"：自動計算されます"]
[null,"残業手当：基本給から日給を算出してから計算しています"]
[null,null,null,null,"日給単価が決まっているときは、計算値では固定値に書き換えてください"]
[null,null,null,null,"早出残業、早朝深夜には対応していません。自社の計算方法を入力してください。"]
[null,null,null,null,"シート保護はしていません、修正して使用する時はコピーして利用。"]

{"sheet":"社員マスタ","index":1,"n_rows":28,"n_cols":12,"rows_kept":28,"cut":false,"hidden":false,"merged":[]}
["個人コード","氏名","基本給","残業手当","通勤手当","住宅手当","家族手当","健康保険","介護保険","厚生年金","住民税","扶養人数"]
["A001","埼玉　太郎",200000,null,12000,10000,5000,7000,2500,17000,4000,0]
["A002","埼玉　花子",200000,null,12001,10001,5001,7001,2501,17001,4001,0]
["A003","埼玉　次郎",200000,null,12002,10002,5002,7002,2502,17002,4002,0]
["A004","埼玉　２男",200000,null,12003,10003,5003,7003,2503,17003,4003,0]
["A005","埼玉　３男",200000,null,12004,10004,5004,7004,2504,17004,4004,2]
["A006","埼玉　４男",960,null,12005,10005,5005,7005,2505,17005,4005,1]
["A007","埼玉　５男",200000,null,12006,10006,5006,7006,2506,17006,4006,0]
["A008","埼玉　６男",200000,11,12007,10007,5007,7007,2507,17007,4007,0]
["A009","埼玉　７男",200000,null,12008,10008,5008,7008,2508,17008,4008,0]
["A010","東京　太郎",250000,null,12009,10009,5009,7009,2509,17009,4009,0]
["A011","東京　花子",200001,null,12010,10010,5010,7010,2510,17010,4010,1]
["A012","東京　次郎",200000,null,12011,10011,5011,7011,2511,17011,4011,0]
["A013","東京　２男",200000,null,12012,10012,5012,7012,2512,17012,4012,0]
["A014","東京　３男",200000,null,12013,10013,5013,7013,2513,17013,4013,0]
["A015","東京　４男",200000,null,12014,10014,5014,7014,2514,17014,4014,0]
["A016","東京　５男",200000,null,12015,10015,5015,7015,2515,17015,4015,0]
["A017","東京　６男",200000,null,12016,10016,5016,7016,2516,17016,4016,0]
["A018","東京　７男",200000,null,12017,10017,5017,7017,2517,17017,4017,0]
["A019","大坂　太郎",240000,null,12018,10018,5018,7018,2518,17018,4018,0]
["A020","大坂　花子",124300,null,12019,10019,5019,7019,2519,17019,4019,0]
["A021","大坂　次郎",200000,null,12020,10020,5020,7020,2520,17020,4020,0]
["A022","大坂　２男",200000,null,12021,10021,5021,7021,2521,17021,4021,0]
["A023","大坂　３男",200000,null,12022,10022,5022,7022,2522,17022,4022,0]
["A024","大坂　４男",200000,null,12023,10023,5023,7023,2523,17023,4023,0]
["A025","大坂　５男",200000,null,12024,10024,5024,7024,2524,17024,4024,0]
["A026","大坂　６男",200000,null,12025,10025,5025,7025,2525,17025,4025,0]
["A027","大坂　７男",200000,null,12026,10026,5026,7026,2526,17026,4026,0]

{"sheet":"伝票風","index":2,"n_rows":44,"n_cols":48,"rows_kept":44,"cut":false,"hidden":false,"merged":[[4,13,4,14],[4,16,4,17],[6,17,6,18],[6,19,6,20],[7,17,7,18],[7,19,7,20],[6,13,6,16],[7,13,7,16],[29,13,29,16],[29,17,29,20],[28,13,28,16],[28,17,28,20],[23,13,23,16],[23,17,23,20],[18,13,18,16],[18,17,18,20],[8,17,8,18],[8,19,8,20],[15,17,15,20],[16,13,16,16],[16,17,16,20],[17,13,17,16],[17,17,17,20],[11,17,11,20],[30,13,30,16],[30,17,30,20],[26,13,26,16],[26,17,26,20],[27,13,27,16],[27,17,27,20],[25,13,25,16],[25,17,25,20],[19,13,19,16],[19,17,19,20],[21,13,21,16],[21,17,21,20],[22,13,22,16],[22,17,22,20],[24,13,24,16],[24,17,24,20],[12,17,12,20],[9,17,9,18],[9,19,9,20],[13,13,13,16],[13,17,13,20],[14,13,14,16],[14,17,14,20],[8,13,8,16],[9,13,9,16],[11,13,11,16],[29,1,29,4],[30,1,30,4],[30,5,30,8],[18,1,18,4],[25,1,25,4],[26,1,26,4],[28,1,28,4],[26,5,26,8],[29,5,29,8],[28,5,28,8],[21,1,21,4],[22,1,22,4],[23,1,23,4],[24,1,24,4],[25,5,25,8],[11,5,11,8],[12,5,12,8],[8,7,8,8],[9,7,9,8],[14,1,14,4],[6,7,6,8],[7,7,7,8],[15,13,15,16],[17,1,17,4],[11,1,11,4],[12,1,12,4],[13,1,13,4],[15,1,15,4],[12,13,12,16],[4,1,4,2],[4,4,4,5],[6,1,6,4],[7,1,7,4],[8,1,8,4],[9,1,9,4],[6,5,6,6],[7,5,7,6],[8,5,8,6],[9,5,9,6],[27,1,27,4],[27,5,27,8],[19,5,19,8],[21,5,21,8],[22,5,22,8],[23,5,23,8],[24,5,24,8],[13,5,13,8],[14,5,14,8],[15,5,15,8],[16,5,16,8],[17,5,17,8],[18,5,18,8],[16,1,16,4],[19,1,19,4]]}
[null,null,null,"常勤者用",null,null,null,null,null,null,null,null,null,null,null,"パート用"]
[]
[]
[null,"給与支給明細書",null,null,null,null,null,null,null,null,null,null,null,"給与支給明細書",null,null,null,null,null,null,null,null,null,null,null,null,null,null,null,null,null,null,null,null,null,null,null,null,null,null,null,null,null,null,null,"氏名",null,{"$f":"LOOKUP(code1,社員マスタ!A3:A29,社員マスタ!B3:B29)","v":"東京　花子"}]
[null,null,null,"年",null,null,"月分",null,null,null,null,null,null,null,null,"年",null,null,"月分"]
[null,"a005",null,{"$f":"LOOKUP(ncd,社員マスタ!A2:A28,社員マスタ!B2:B28)&\" 様\"","v":"埼玉　３男 様"},null,null,null,null,null,null,null,null,null,"a006",null,{"$f":"LOOKUP(_ncd2,[0]!code_all,[0]!name_a)&\" 様\"","v":"埼玉　４男 様"}]
[null,"出勤日数",null,null,null,20,null,"日",null,null,null,null,null,"出勤日数",null,null,null,15,null,"日"]
[null,"欠勤日数",null,null,null,1,null,"日",null,null,null,null,null,"欠勤日数",null,null,null,0,null,"日"]
[null,"労働時間",null,null,null,null,null,"時間",null,null,null,null,null,"労働時間",null,null,null,100,null,"時間"]
[null,"時間外労働時間",null,null,null,4,null,"時間",null,null,null,null,null,"時間外労働時間",null,null,null,5,null,"時間"]
[]
[null,"基本給",null,null,null,{"$f":"LOOKUP(ycode1,社員マスタ,基本給)","v":200000},null,null,null,null,null,null,null,"基本給",null,null,null,{"$f":"LOOKUP(ycode2,社員マスタ,基本給)*de_day1","v":14400}]
[null,"残業手当",null,null,null,{"$f":"ROUND(F12/(8*21)*1.25*F10,0)","v":5952},null,null,null,null,null,null,null,"残業手当",null,null,null,{"$f":"ROUND(R12/(8*21)*1.25*R10,0)","v":536}]
[null,"通勤手当",null,null,null,{"$f":"LOOKUP(ycode1,社員マスタ,通勤手当)","v":12004},null,null,null,null,null,null,null,"通勤手当",null,null,null,{"$f":"LOOKUP(ycode2,社員マスタ,通勤手当)","v":12005}]
[null,"住宅手当",null,null,null,{"$f":"LOOKUP(ycode1,社員マスタ,住宅手当)","v":10004},null,null,null,null,null,null,null,"住宅手当",null,null,null,{"$f":"LOOKUP(ycode2,社員マスタ,住宅手当)","v":10005}]
[null,"家族手当",null,null,null,{"$f":"LOOKUP(code1,社員マスタ,家族手当)","v":5010},null,null,null,null,null,null,null,"家族手当",null,null,null,{"$f":"LOOKUP(code2,社員マスタ,家族手当)","v":5005}]
[]
[]
[]
[null,"支給額計",null,null,null,{"$f":"SUM(F12:I19)","v":232970},null,null,null,null,null,null,null,"支給額計",null,null,null,{"$f":"SUM(R12:U19)","v":41951}]
[]
[null,"健康保険",null,null,null,{"$f":"LOOKUP(ycode1,社員マスタ,健康保険)","v":7004},null,null,null,null,null,null,null,"健康保険",null,null,null,{"$f":"LOOKUP(ycode2,社員マスタ,健康保険)","v":7005}]
[null,"厚生年金",null,null,null,{"$f":"LOOKUP(code1,社員マスタ,厚生年金)","v":17010},null,null,null,null,null,null,null,"厚生年金",null,null,null,{"$f":"LOOKUP(code2,社員マスタ,厚生年金)","v":17005}]
[null,"介護保険",null,null,null,{"$f":"LOOKUP(ycode1,社員マスタ,介護保険)","v":2504},null,null,null,null,null,null,null,"介護保険",null,null,null,{"$f":"LOOKUP(ycode2,社員マスタ,介護保険)","v":2505}]
[null,"雇用保険",null,null,null,{"$f":"ROUND(支給額計*(3/1000),0)","v":699},null,null,null,null,null,null,null,"雇用保険",null,null,null,{"$f":"ROUND(支給額計*(3/1000),0)","v":699}]
[null,"所得税",null,null,null,{"$f":"GenSenTax(課税対象額,LOOKUP(ycode1,社員マスタ,扶養人数))","v":2580},null,null,null,null,null,null,null,"所得税",null,null,null,{"$f":"GenSenTax(課税対象額,LOOKUP(ycode2,社員マスタ,扶養人数))","v":4190}]
[null,"控除額計",null,null,null,{"$f":"SUM(F22:I26)","v":29797},null,null,null,null,null,null,null,"控除額計",null,null,null,{"$f":"SUM(R22:U26)","v":31404}]
[]
[]
[null,"課税対象額",null,null,null,{"$f":"支給額計-F22-F23-F24-F25","v":205753},null,null,null,null,null,null,null,"課税対象額",null,null,null,{"$f":"支給額計-R22-R23-R24-R25","v":205756}]
[null,"差引支給額",null,null,null,{"$f":"支給額計-F27","v":203173},null,null,null,null,null,null,null,"差引支給額",null,null,null,{"$f":"支給額計1-R27","v":10547}]
[]
[]
[]
[]
[]
[null,"項目説明"]
[null,null,null,"：社員マスタの値をコードから索引して該当値が表示されます"]
[null,null,null,"：は手入力を行う"]
[null,null,null,"：自動計算されます"]
[null,"残業手当：基本給から日給を算出してから計算しています"]
[null,null,null,null,"日給単価が決まっているときは、計算値では固定値に書き換えてください"]
[null,null,null,null,"早出残業、早朝深夜には対応していません。自社の計算方法を入力してください。"]
[null,null,null,null,"シート保護はしていません、修正して使用する時はコピーして利用。"]

{"sheet":"月額表","index":3,"n_rows":413,"n_cols":12,"rows_kept":413,"cut":false,"hidden":false,"merged":[[410,1,410,11],[411,1,411,11],[412,1,412,11],[405,1,405,11],[406,1,406,11],[407,1,407,11],[408,1,408,11],[409,1,409,11],[400,1,400,11],[401,1,401,11],[402,1,402,11],[403,1,403,11],[404,1,404,11],[395,1,395,11],[396,1,396,11],[397,1,397,11],[398,1,398,11],[399,1,399,11],[390,1,390,11],[391,1,391,11],[392,1,392,11],[393,1,393,11],[394,1,394,11],[363,11,373,11],[374,11,386,11],[387,1,387,11],[388,1,388,11],[389,1,389,11],[0,1,0,11],[1,1,1,11],[290,11,299,11],[300,11,317,11],[320,11,362,11]]}
[null,"給与所得の源泉徴収税額表（令和８年分） 参考です　所得税は計算式によるものです"]
[null,"月　額　表（平成24年３月31日財務省告示第115号別表第一（令和７年４月30日財務省告示第122号改正））"]
[null,"   その月の社会保",null,"甲",null,null,null,null,null,null,null,"　"]
[null,"   険料等控除後の",null,"扶        養        親        族        等        の        数",null,null,null,null,null,null,null,"乙"]
[null,"   給与等の金額",null,"0  人","1  人","2  人","3  人","4  人","5  人","6  人","7  人"]
[null,"以  上","未  満","税                                            額",null,null,null,null,null,null,null,"税  額"]
[null,"円","円","円","円","円","円","円","円","円","円","円"]
[null,105000,"円未満",0,0,0,0,0,0,0,0,"その月の社会保険料等控除後の給与等の金額の3.063％に相当する金額"]
[]
[1,105000,107000,170,0,0,0,0,0,0,0,3800]
[2,107000,109000,280,0,0,0,0,0,0,0,3800]
[3,109000,111000,380,0,0,0,0,0,0,0,3900]
[4,111000,113000,480,0,0,0,0,0,0,0,4000]
[5,113000,115000,580,0,0,0,0,0,0,0,4100]
[]
[6,115000,117000,680,0,0,0,0,0,0,0,4100]
[7,117000,119000,790,0,0,0,0,0,0,0,4200]
[8,119000,121000,890,0,0,0,0,0,0,0,4300]
[9,121000,123000,990,0,0,0,0,0,0,0,4300]
[10,123000,125000,1090,0,0,0,0,0,0,0,4400]
[]
[11,125000,127000,1190,0,0,0,0,0,0,0,4700]
[12,127000,129000,1300,0,0,0,0,0,0,0,5000]
[13,129000,131000,1400,0,0,0,0,0,0,0,5300]
[14,131000,133000,1500,0,0,0,0,0,0,0,5500]
[15,133000,135000,1600,0,0,0,0,0,0,0,5800]
[]
[16,135000,137000,1710,0,0,0,0,0,0,0,6100]
[17,137000,139000,1810,190,0,0,0,0,0,0,6400]
[18,139000,141000,1910,300,0,0,0,0,0,0,6700]
[19,141000,143000,2010,400,0,0,0,0,0,0,7000]
[20,143000,145000,2110,500,0,0,0,0,0,0,7400]
[]
[21,145000,147000,2220,600,0,0,0,0,0,0,7700]
[22,147000,149000,2320,700,0,0,0,0,0,0,8000]
[23,149000,151000,2420,810,0,0,0,0,0,0,8300]
[24,151000,153000,2520,910,0,0,0,0,0,0,8600]
[25,153000,155000,2620,1010,0,0,0,0,0,0,8900]
[]
[26,155000,157000,2730,1110,0,0,0,0,0,0,9200]
[27,157000,159000,2830,1210,0,0,0,0,0,0,9500]
[28,159000,161000,2910,1300,0,0,0,0,0,0,9800]
[29,161000,163000,2980,1370,0,0,0,0,0,0,10100]
[30,163000,165000,3050,1440,0,0,0,0,0,0,10400]
[]
[31,165000,167000,3120,1510,0,0,0,0,0,0,10700]
[32,167000,169000,3200,1580,0,0,0,0,0,0,11000]
[33,169000,171000,3270,1650,0,0,0,0,0,0,11300]
[34,171000,173000,3340,1730,100,0,0,0,0,0,11500]
[35,173000,175000,3410,1800,170,0,0,0,0,0,11800]
[]
[36,175000,177000,3480,1870,250,0,0,0,0,0,12100]
[37,177000,179000,3550,1940,320,0,0,0,0,0,12500]
[38,179000,181000,3620,2010,390,0,0,0,0,0,12800]
[39,181000,183000,3700,2080,460,0,0,0,0,0,13300]
[40,183000,185000,3770,2150,530,0,0,0,0,0,14000]
[]
[41,185000,187000,3840,2230,600,0,0,0,0,0,14700]
[42,187000,189000,3910,2300,670,0,0,0,0,0,15400]
[43,189000,191000,3980,2370,750,0,0,0,0,0,16100]
[44,191000,193000,4050,2440,820,0,0,0,0,0,16800]
[45,193000,195000,4120,2510,890,0,0,0,0,0,17600]
[]
[46,195000,197000,4200,2580,960,0,0,0,0,0,18300]
[47,197000,199000,4270,2650,1030,0,0,0,0,0,19000]
[48,199000,201000,4340,2730,1100,0,0,0,0,0,19700]
[49,201000,203000,4410,2800,1170,0,0,0,0,0,20400]
[50,203000,205000,4480,2870,1250,0,0,0,0,0,21000]
[]
[51,205000,207000,4550,2940,1320,0,0,0,0,0,21700]
[52,207000,209000,4630,3010,1390,0,0,0,0,0,22500]
[53,209000,211000,4700,3080,1460,0,0,0,0,0,23000]
[54,211000,213000,4770,3150,1530,0,0,0,0,0,23600]
[55,213000,215000,4840,3230,1600,0,0,0,0,0,24100]
[]
[56,215000,217000,4910,3300,1670,0,0,0,0,0,24700]
[57,217000,219000,4980,3370,1750,130,0,0,0,0,25300]
[58,219000,221000,5050,3440,1820,200,0,0,0,0,25800]
[59,221000,224000,5150,3520,1910,300,0,0,0,0,26400]
[60,224000,227000,5250,3630,2020,400,0,0,0,0,27500]
[]
[61,227000,230000,5360,3740,2120,510,0,0,0,0,28500]
[62,230000,233000,5460,3850,2240,610,0,0,0,0,29500]
[63,233000,236000,5570,3950,2340,720,0,0,0,0,30500]
[64,236000,239000,5680,4060,2450,830,0,0,0,0,31500]
[65,239000,242000,5790,4170,2550,940,0,0,0,0,32600]
[]
[66,242000,245000,5890,4280,2660,1040,0,0,0,0,33600]
[67,245000,248000,6000,4380,2770,1150,0,0,0,0,34600]
[68,248000,251000,6110,4490,2880,1260,0,0,0,0,35500]
[69,251000,254000,6220,4590,2980,1370,0,0,0,0,36600]
[70,254000,257000,6320,4710,3090,1470,0,0,0,0,37600]
[]
[71,257000,260000,6430,4810,3200,1580,0,0,0,0,38600]
[72,260000,263000,6530,4920,3310,1680,0,0,0,0,39600]
[73,263000,266000,6650,5020,3410,1800,170,0,0,0,40600]
[74,266000,269000,6750,5140,3520,1900,290,0,0,0,41700]
[75,269000,272000,6860,5240,3620,2010,390,0,0,0,42700]
[]
[76,272000,275000,6960,5350,3740,2110,500,0,0,0,43700]
[77,275000,278000,7080,5450,3840,2230,600,0,0,0,44700]
[78,278000,281000,7180,5560,3950,2330,710,0,0,0,45600]
[79,281000,284000,7290,5670,4050,2440,820,0,0,0,46700]
[80,284000,287000,7390,5780,4170,2540,930,0,0,0,47800]
[]
[81,287000,290000,7500,5880,4270,2650,1030,0,0,0,48900]
[82,290000,293000,7610,5990,4380,2760,1140,0,0,0,50000]
[83,293000,296000,7720,6100,4480,2870,1250,0,0,0,51300]
[84,296000,299000,7820,6210,4590,2970,1360,0,0,0,52400]
[85,299000,302000,7930,6320,4700,3080,1470,0,0,0,53600]
[]
[86,302000,305000,8060,6440,4820,3210,1590,0,0,0,54500]
[87,305000,308000,8180,6570,4940,3330,1720,0,0,0,55200]
[88,308000,311000,8300,6690,5060,3450,1840,210,0,0,56100]
[89,311000,314000,8550,6810,5190,3570,1960,340,0,0,56900]
[90,314000,317000,8790,6930,5310,3700,2080,460,0,0,57700]
[]
[91,317000,320000,9040,7060,5430,3820,2210,580,0,0,58500]
[92,320000,323000,9280,7180,5550,3940,2330,700,0,0,59500]
[93,323000,326000,9530,7300,5680,4060,2450,830,0,0,60500]
{"$rows_left_out":293}